BDBM10302 5-iodo-1-methyl-2,3-dihydro-1H-indole-2,3-dione::CHEMBL64413::Isatin analog 6
SMILES CN1C(=O)C(=O)c2cc(I)ccc12
InChI Key InChIKey=FVRVCKWJOSBBDD-UHFFFAOYSA-N
Data  1 KI  1 IC50
  Tab Delimited (TSV)   2D SDfile   Computed 3D by Vconf -m prep SDfile
Find this compound or compounds like it in BindingDB:
Activity Spreadsheet -- Enzyme Inhibition Constant Data from BindingDB
Found 1 hit for monomerid = 10302
TargetGenome polyprotein(Human rhinovirus B)
Agouron Pharmaceuticals
Curated by ChEMBL
LigandPNGBDBM10302(5-iodo-1-methyl-2,3-dihydro-1H-indole-2,3-dione | ...)
Affinity DataKi:  3.00E+4nM. Assay description: Inhibition of human rhinovirus 3C protease
In DepthDetails ArticlePubMed